{"text_format":"1","workbook":"xlsx","n_sheets":12,"sheets":["Overview","Group Stage","Knockout Rounds","OddsCreation","OddsCreation (2)","OddsCreation (3)","OddsCreation (4)","KOCoeffs","OddsTesting","GroupQuals","GroupQuals (2)","Simulations"],"not_rendered":{"charts":20,"images":1,"macros":1,"external_links":0,"defined_names":176,"comments":0,"pivot_tables":0},"unopened":[],"bounds":{"document_bytes":16777216,"sheet_cells":100000,"rows_first":2000,"rows_last":500,"rows_between":2000,"halvings":0,"cell_chars":16384,"cell_head_chars":4096},"cells_cut":0,"cells_raw":0,"read":"whole","date_system":"1900"}

{"sheet":"Overview","index":0,"n_rows":37,"n_cols":21,"rows_kept":37,"cut":false,"hidden":false,"merged":[[29,9,29,12],[30,9,30,12],[25,9,25,12],[0,6,3,15],[10,9,10,12],[17,9,17,12],[22,9,22,12],[27,9,28,12],[20,9,20,12]]}
[null,null,null,null,null,null,{"$f":"IF(C34<0.95, \"TGIAF 2014 World Cup Simulator\", \"Paul the Octopus predicts:\")","v":"TGIAF 2014 World Cup Simulator"}]
[]
[]
[]
[]
[]
{"$rows_left_out":32}
{"sheet":"Group Stage","index":1,"n_rows":56,"n_cols":35,"rows_kept":56,"cut":false,"hidden":false,"merged":[]}
["Team 1","1W","D","2W","Team 2",null,null,null,null,null,null,"C1","C2","C3",null,"Random","Result"]
["Brazil",0.3,3.6,9,"Croatia",{"$f":"1/B2","v":3.3333333333333335},{"$f":"1/C2","v":0.27777777777777779},0.1111111111111111,{"$f":"F2/($F2+$G2+$H2)","v":0.89552238805970152},{"$f":"G2/($F2+$G2+$H2)","v":7.4626865671641798E-2},{"$f":"H2/($F2+$G2+$H2)","v":2.9850746268656712E-2},{"$f":"I2","v":0.89552238805970152},{"$f":"I2+J2","v":0.97014925373134331},{"$f":"I2+J2+K2","v":1},null,{"$f":"RAND()","v":0.71945445983715228},{"$f":"IF(P2<L2, A2, IF(P2<M2, \"Draw\", E2))","v":"Brazil"},null,"Group A","M1","M2","M3","Ran","Tot","Pos","Group A"]
["Mexico",1.1499999999999999,2,2.5,"Cameroon",{"$f":"1/B3","v":0.86956521739130443},{"$f":"1/C3","v":0.5},{"$f":"1/D3","v":0.4},{"$f":"F3/($F3+$G3+$H3)","v":0.49140049140049141},{"$f":"G3/($F3+$G3+$H3)","v":0.28255528255528251},{"$f":"H3/($F3+$G3+$H3)","v":0.22604422604422603},{"$f":"I3","v":0.49140049140049141},{"$f":"I3+J3","v":0.77395577395577386},{"$f":"I3+J3+K3","v":0.99999999999999989},null,{"$f":"RAND()","v":0.19876045951391241},{"$f":"IF(P3<L3, A3, IF(P3<M3, \"Draw\", E3))","v":"Mexico"},null,"Brazil",{"$f":"IF($Q2=$S3, 3, IF($Q2=\"Draw\", 1, 0))","v":3},{"$f":"IF($Q4=$S3, 3, IF($Q4=\"Draw\", 1, 0))","v":3},{"$f":"IF($Q6=$S3, 3, IF($Q6=\"Draw\", 1, 0))","v":3},{"$f":"RAND()/10","v":3.4869947160956441E-2},{"$f":"SUM(T3:W3)","v":9.0348699471609564},{"$f":"VLOOKUP(S3, AH3:AI6, 2, FALSE)","v":1},"Brazil","BRA",null,1,{"$f":"VLOOKUP(AC3,Y3:Z6,2, FALSE)","v":"Brazil"},{"$f":"VLOOKUP(AD3,Z$3:AA$6,2, FALSE)","v":"BRA"},null,{"$f":"LARGE(X3:X6, 1)","v":9.0348699471609564},{"$f":"VLOOKUP(AG3, X3:Z6, 3, FALSE)","v":"Brazil"},1]
["Brazil",0.36399999999999999,3.3330000000000002,6,"Mexico",2.7472527472527473,0.30003000300030003,0.16666666666666666,0.85479028785890043,9.335243467765969E-2,5.1857277463439953E-2,0.85479028785890043,0.94814272253656018,1.0000000000000002,null,0.63010975450974038,"Brazil",null,"Croatia",{"$f":"IF($Q2=$S4, 3, IF($Q2=\"Draw\", 1, 0))","v":0},{"$f":"IF($Q5=$S4, 3, IF($Q5=\"Draw\", 1, 0))","v":0},{"$f":"IF($Q7=$S4, 3, IF($Q7=\"Draw\", 1, 0))","v":1},{"$f":"RAND()/10","v":4.9314430132402623E-2},{"$f":"SUM(T4:W4)","v":1.0493144301324027},{"$f":"VLOOKUP(S4, AH3:AI6, 2, FALSE)","v":4},"Croatia","CRO",null,2,{"$f":"VLOOKUP(AC4,Y3:Z6,2, FALSE)","v":"Mexico"},{"$f":"VLOOKUP(AD4,Z$3:AA$6,2, FALSE)","v":"MEX"},null,{"$f":"LARGE(X3:X6, 2)","v":4.0020709217713755},{"$f":"VLOOKUP(AG4, X3:Z6, 3, FALSE)","v":"Mexico"},2]
["Cameroon",2.4,2,1.05,"Croatia",0.41666666666666669,0.5,0.95238095238095233,0.22292993630573249,0.26751592356687898,0.50955414012738853,0.22292993630573249,0.49044585987261147,1,null,1.1102291396274611E-2,"Cameroon",null,"Mexico",{"$f":"IF($Q3=$S5, 3, IF($Q3=\"Draw\", 1, 0))","v":3},{"$f":"IF($Q4=$S5, 3, IF($Q4=\"Draw\", 1, 0))","v":0},{"$f":"IF($Q7=$S5, 3, IF($Q7=\"Draw\", 1, 0))","v":1},2.0709217713753003E-3,4.0020709217713755,{"$f":"VLOOKUP(S5, AH3:AI6, 2, FALSE)","v":2},"Mexico","MEX",null,3,{"$f":"VLOOKUP(AC5,Y3:Z6,2, FALSE)","v":"Cameroon"},{"$f":"VLOOKUP(AD5,Z$3:AA$6,2, FALSE)","v":"CAM"},null,{"$f":"LARGE(X3:X6, 3)","v":3.0931837054269944},{"$f":"VLOOKUP(AG5, X3:Z6, 3, FALSE)","v":"Cameroon"},3]
["Cameroon",12,4,0.2,"Brazil",8.3333333333333329E-2,0.25,5,1.5625E-2,4.6875E-2,0.9375,1.5625E-2,6.25E-2,1,null,0.87511812612501605,"Brazil",null,"Cameroon",{"$f":"IF($Q3=$S6, 3, IF($Q3=\"Draw\", 1, 0))","v":0},{"$f":"IF($Q5=$S6, 3, IF($Q5=\"Draw\", 1, 0))","v":3},{"$f":"IF($Q6=$S6, 3, IF($Q6=\"Draw\", 1, 0))","v":0},9.3183705426994251E-2,3.0931837054269944,{"$f":"VLOOKUP(S6, AH3:AI6, 2, FALSE)","v":3},"Cameroon","CAM",null,4,{"$f":"VLOOKUP(AC6,Y3:Z6,2, FALSE)","v":"Croatia"},{"$f":"VLOOKUP(AD6,Z$3:AA$6,2, FALSE)","v":"CRO"},null,{"$f":"LARGE(X3:X6, 4)","v":1.0493144301324027},{"$f":"VLOOKUP(AG6, X3:Z6, 3, FALSE)","v":"Croatia"},4]
{"$rows_left_out":51}
{"sheet":"Knockout Rounds","index":2,"n_rows":30,"n_cols":33,"rows_kept":30,"cut":false,"hidden":false,"merged":[[0,0,0,4],[12,0,12,4],[19,0,19,4],[28,0,28,4],[24,0,24,4]]}
["Round of 16",null,null,null,null,null,null,null,null,null,null,null,null,null,null,null,null,null,null,"1T","2T","1T/2T","2T/1T","1WC","1WE","2WC","2WE","1DC","1DE","2DC","2DE","1DO","2DO"]
["Team 1","1W","D","2W","Team 2",null,null,null,null,null,null,"C1","C2","C3",null,"Rand","Result","Rand2"]
[{"$f":"'Group Stage'!AD3","v":"Brazil"},{"$f":"X3*(V3^Y3)","v":0.20203485821945716},{"$f":"AVERAGE(AF3:AG3)","v":4.2178471059441325},{"$f":"Z3*(W3^AA3)","v":12},{"$f":"'Group Stage'!AD11","v":"Australia"},{"$f":"1/B3","v":4.9496409125288956},{"$f":"1/C3","v":0.23708777840494},8.3333333333333329E-2,{"$f":"F3/($F3+$G3+$H3)","v":0.9391997456077702},{"$f":"G3/($F3+$G3+$H3)","v":4.4987663771928442E-2},{"$f":"H3/($F3+$G3+$H3)","v":1.5812590620301339E-2},{"$f":"I3","v":0.9391997456077702},{"$f":"I3+J3","v":0.98418740937969862},{"$f":"I3+J3+K3","v":1},null,{"$f":"RAND()","v":0.28894327070566805},{"$f":"IF(P3<L3, A3, IF(P3<M3, IF(R3<0.5, A3, E3), E3))","v":"Brazil"},{"$f":"RAND()","v":0.74961024449765123},null,{"$f":"VLOOKUP(A3, KOCoeffs!$A$2:$B$33, 2, FALSE)","v":2.9},{"$f":"VLOOKUP(E3, KOCoeffs!$A$2:$B$33, 2, FALSE)","v":850},{"$f":"T3/U3","v":3.4117647058823529E-3},{"$f":"U3/T3","v":293.10344827586209},{"$f":"VLOOKUP(V3, KOCoeffs!$J$14:$K$17, 2)","v":1.65},{"$f":"VLOOKUP(V3, KOCoeffs!$J$14:$L$17, 3)","v":0.36969999999999997},{"$f":"VLOOKUP(W3, KOCoeffs!$J$14:$K$17, 2)","v":12},{"$f":"VLOOKUP(W3, KOCoeffs!$J$14:$L$17, 3)","v":0},{"$f":"VLOOKUP(V3, KOCoeffs!$J$14:$M$17, 4)","v":1.87},{"$f":"VLOOKUP(V3, KOCoeffs!$J$14:$N$17, 5)","v":-0.13100000000000001},{"$f":"VLOOKUP(W3, KOCoeffs!$J$14:$M$17, 4)","v":4.5},{"$f":"VLOOKUP(W3, KOCoeffs!$J$14:$N$17, 5)","v":0},{"$f":"AB3*(V3^AC3)","v":3.9356942118882645},{"$f":"AD3*(W3^AE3)","v":4.5}]
[{"$f":"'Group Stage'!AD17","v":"Colombia"},{"$f":"X4*(V4^Y4)","v":1.5659651136073058},{"$f":"AVERAGE(AF4:AG4)","v":1.9651320486683397},{"$f":"Z4*(W4^AA4)","v":1.631754233055569},{"$f":"'Group Stage'!AD25","v":"Uruguay"},{"$f":"1/B4","v":0.63858383006785691},0.50887165606893658,0.61283738674753307,{"$f":"F4/($F4+$G4+$H4)","v":0.36277135464481314},0.28908351780980934,0.34814512754537769,{"$f":"I4","v":0.36277135464481314},{"$f":"I4+J4","v":0.65185487245462248},{"$f":"I4+J4+K4","v":1.0000000000000002},null,{"$f":"RAND()","v":0.37638314588217114},{"$f":"IF(P4<L4, A4, IF(P4<M4, IF(R4<0.5, A4, E4), E4))","v":"Colombia"},3.8507299218835001E-2,null,{"$f":"VLOOKUP(A4, KOCoeffs!$A$2:$B$33, 2, FALSE)","v":27},{"$f":"VLOOKUP(E4, KOCoeffs!$A$2:$B$33, 2, FALSE)","v":26.2},{"$f":"T4/U4","v":1.0305343511450382},{"$f":"U4/T4","v":0.97037037037037033},{"$f":"VLOOKUP(V4, KOCoeffs!$J$14:$K$17, 2)","v":1.55},{"$f":"VLOOKUP(V4, KOCoeffs!$J$14:$L$17, 3)","v":0.3407},{"$f":"VLOOKUP(W4, KOCoeffs!$J$14:$K$17, 2)","v":1.65},{"$f":"VLOOKUP(W4, KOCoeffs!$J$14:$L$17, 3)","v":0.36969999999999997},{"$f":"VLOOKUP(V4, KOCoeffs!$J$14:$M$17, 4)","v":2.0499999999999998},{"$f":"VLOOKUP(V4, KOCoeffs!$J$14:$N$17, 5)","v":4.6699999999999998E-2},{"$f":"VLOOKUP(W4, KOCoeffs!$J$14:$M$17, 4)","v":1.87},{"$f":"VLOOKUP(W4, KOCoeffs!$J$14:$N$17, 5)","v":-0.13100000000000001},{"$f":"AB4*(V4^AC4)","v":2.052881488397412},{"$f":"AD4*(W4^AE4)","v":1.8773826089392676}]
[{"$f":"'Group Stage'!AD31","v":"Ecuador"},0.7043425806334066,2.4462140149012517,3.8408734278867063,{"$f":"'Group Stage'!AD39","v":"Iran"},1.4197636597530598,0.40879497619931993,0.26035744701699576,0.67966524425187935,0.19569717497613476,0.12463758077198581,0.67966524425187935,0.87536241922801405,0.99999999999999989,null,0.70245664166696631,"Iran",0.61741754241071845,null,{"$f":"VLOOKUP(A5, KOCoeffs!$A$2:$B$33, 2, FALSE)","v":145},{"$f":"VLOOKUP(E5, KOCoeffs!$A$2:$B$33, 2, FALSE)","v":1450},0.1,10,{"$f":"VLOOKUP(V5, KOCoeffs!$J$14:$K$17, 2)","v":1.65},{"$f":"VLOOKUP(V5, KOCoeffs!$J$14:$L$17, 3)","v":0.36969999999999997},{"$f":"VLOOKUP(W5, KOCoeffs!$J$14:$K$17, 2)","v":2},{"$f":"VLOOKUP(W5, KOCoeffs!$J$14:$L$17, 3)","v":0.28339999999999999},{"$f":"VLOOKUP(V5, KOCoeffs!$J$14:$M$17, 4)","v":1.87},{"$f":"VLOOKUP(V5, KOCoeffs!$J$14:$N$17, 5)","v":-0.13100000000000001},{"$f":"VLOOKUP(W5, KOCoeffs!$J$14:$M$17, 4)","v":1.58},{"$f":"VLOOKUP(W5, KOCoeffs!$J$14:$N$17, 5)","v":0.17499999999999999},2.5283756931732984,2.364052336629205]
[{"$f":"'Group Stage'!AD45","v":"Portugal"},1.8624466726562201,2.0545334473290739,1.3518963109448991,{"$f":"'Group Stage'!AD53","v":"Belgium"},0.53692812507420717,0.48672850826547304,0.73970170042187366,0.30449178411108591,0.27602359596826553,0.41948461992064867,0.30449178411108591,0.58051538007935144,1,null,2.2426605546916889E-2,"Portugal",0.70175596399645224,null,{"$f":"VLOOKUP(A6, KOCoeffs!$A$2:$B$33, 2, FALSE)","v":28.8},{"$f":"VLOOKUP(E6, KOCoeffs!$A$2:$B$33, 2, FALSE)","v":16.8},1.7142857142857142,0.58333333333333337,{"$f":"VLOOKUP(V6, KOCoeffs!$J$14:$K$17, 2)","v":1.55},{"$f":"VLOOKUP(V6, KOCoeffs!$J$14:$L$17, 3)","v":0.3407},{"$f":"VLOOKUP(W6, KOCoeffs!$J$14:$K$17, 2)","v":1.65},{"$f":"VLOOKUP(W6, KOCoeffs!$J$14:$L$17, 3)","v":0.36969999999999997},{"$f":"VLOOKUP(V6, KOCoeffs!$J$14:$M$17, 4)","v":2.0499999999999998},{"$f":"VLOOKUP(V6, KOCoeffs!$J$14:$N$17, 5)","v":4.6699999999999998E-2},{"$f":"VLOOKUP(W6, KOCoeffs!$J$14:$M$17, 4)","v":1.87},{"$f":"VLOOKUP(W6, KOCoeffs!$J$14:$N$17, 5)","v":-0.13100000000000001},2.1022557391580343,2.0068111555001136]
{"$rows_left_out":25}
{"sheet":"OddsCreation","index":3,"n_rows":97,"n_cols":14,"rows_kept":97,"cut":false,"hidden":true,"merged":[]}
[null,null,null,null,"T1C","T2C","T1/T2","W","D"]
["Brazil",0.3,3.6,"Croatia",{"$f":"VLOOKUP(A2, KOCoeffs!A$2:B$33, 2, FALSE)","v":2.9},{"$f":"VLOOKUP(D2, KOCoeffs!A$2:B$33, 2, FALSE)","v":165},{"$f":"E2/F2","v":1.7575757575757574E-2},{"$f":"B2","v":0.3},{"$f":"C2","v":3.6}]
["Mexico",1.1499999999999999,2,"Cameroon",{"$f":"VLOOKUP(A3, KOCoeffs!A$2:B$33, 2, FALSE)","v":140},{"$f":"VLOOKUP(D3, KOCoeffs!A$2:B$33, 2, FALSE)","v":800},{"$f":"E3/F3","v":0.17499999999999999},{"$f":"B3","v":1.1499999999999999},{"$f":"C3","v":2}]
["Brazil",0.36399999999999999,3.3330000000000002,"Mexico",{"$f":"VLOOKUP(A4, KOCoeffs!A$2:B$33, 2, FALSE)","v":2.9},{"$f":"VLOOKUP(D4, KOCoeffs!A$2:B$33, 2, FALSE)","v":140},2.0714285714285713E-2,0.36399999999999999,3.3330000000000002]
["Cameroon",2.4,2,"Croatia",{"$f":"VLOOKUP(A5, KOCoeffs!A$2:B$33, 2, FALSE)","v":800},{"$f":"VLOOKUP(D5, KOCoeffs!A$2:B$33, 2, FALSE)","v":165},4.8484848484848486,2.4,2]
["Cameroon",12,4,"Brazil",{"$f":"VLOOKUP(A6, KOCoeffs!A$2:B$33, 2, FALSE)","v":800},{"$f":"VLOOKUP(D6, KOCoeffs!A$2:B$33, 2, FALSE)","v":2.9},275.86206896551727,12,4,null,null,"Croatia",3.6,"Brazil"]
{"$rows_left_out":92}
{"sheet":"OddsCreation (2)","index":4,"n_rows":20,"n_cols":9,"rows_kept":20,"cut":false,"hidden":true,"merged":[]}
[null,null,null,null,"T1C","T2C","T1/T2","W","D"]
["Australia",8,4,"Spain",{"$f":"VLOOKUP(A2, KOCoeffs!A$2:B$33, 2, FALSE)","v":850},{"$f":"VLOOKUP(D2, KOCoeffs!A$2:B$33, 2, FALSE)","v":6},{"$f":"E2/F2","v":141.66666666666666},{"$f":"B2","v":8},{"$f":"C2","v":4}]
["Honduras",7.5,3.5,"France",{"$f":"VLOOKUP(A3, KOCoeffs!A$2:B$33, 2, FALSE)","v":2100},{"$f":"VLOOKUP(D3, KOCoeffs!A$2:B$33, 2, FALSE)","v":21},100,{"$f":"B3","v":7.5},{"$f":"C3","v":3.5}]
["Costa Rica",6.5,3.5,"Italy",{"$f":"VLOOKUP(A4, KOCoeffs!A$2:B$33, 2, FALSE)","v":2200},{"$f":"VLOOKUP(D4, KOCoeffs!A$2:B$33, 2, FALSE)","v":23.4},94.017094017094024,{"$f":"B4","v":6.5},{"$f":"C4","v":3.5}]
["Costa Rica",9,3.2,"Uruguay",{"$f":"VLOOKUP(A5, KOCoeffs!A$2:B$33, 2, FALSE)","v":2200},{"$f":"VLOOKUP(D5, KOCoeffs!A$2:B$33, 2, FALSE)","v":26.2},83.969465648854964,9,3.2]
["Algeria",5.5,3,"Belgium",{"$f":"VLOOKUP(A6, KOCoeffs!A$2:B$33, 2, FALSE)","v":1400},{"$f":"VLOOKUP(D6, KOCoeffs!A$2:B$33, 2, FALSE)","v":16.8},83.333333333333329,5.5,3]
{"$rows_left_out":15}
{"sheet":"OddsCreation (3)","index":5,"n_rows":29,"n_cols":9,"rows_kept":29,"cut":false,"hidden":true,"merged":[]}
[null,null,null,null,"T1C","T2C","T1/T2","W","D"]
["Japan",1.625,2,"Ivory Coast",{"$f":"VLOOKUP(A2, KOCoeffs!A$2:B$33, 2, FALSE)","v":155},{"$f":"VLOOKUP(D2, KOCoeffs!A$2:B$33, 2, FALSE)","v":140},{"$f":"E2/F2","v":1.1071428571428572},{"$f":"B2","v":1.625},{"$f":"C2","v":2}]
["Uruguay",1.625,2.2999999999999998,"Italy",{"$f":"VLOOKUP(A3, KOCoeffs!A$2:B$33, 2, FALSE)","v":26.2},{"$f":"VLOOKUP(D3, KOCoeffs!A$2:B$33, 2, FALSE)","v":23.4},1.1196581196581197,{"$f":"B3","v":1.625},{"$f":"C3","v":2.2999999999999998}]
["Croatia",1.5,2.2999999999999998,"Mexico",{"$f":"VLOOKUP(A4, KOCoeffs!A$2:B$33, 2, FALSE)","v":165},{"$f":"VLOOKUP(D4, KOCoeffs!A$2:B$33, 2, FALSE)","v":140},1.1785714285714286,1.5,2.2999999999999998]
["England",1.625,2.1,"Uruguay",{"$f":"VLOOKUP(A5, KOCoeffs!A$2:B$33, 2, FALSE)","v":31},{"$f":"VLOOKUP(D5, KOCoeffs!A$2:B$33, 2, FALSE)","v":26.2},1.1832061068702291,1.625,2.1]
["Ghana",1.4,2.2000000000000002,"USA",{"$f":"VLOOKUP(A6, KOCoeffs!A$2:B$33, 2, FALSE)","v":230},{"$f":"VLOOKUP(D6, KOCoeffs!A$2:B$33, 2, FALSE)","v":180},1.2777777777777777,1.4,2.2000000000000002]
{"$rows_left_out":24}
{"sheet":"OddsCreation (4)","index":6,"n_rows":49,"n_cols":9,"rows_kept":49,"cut":false,"hidden":true,"merged":[]}
[null,null,null,null,"T1C","T2C","T1/T2","W","D"]
["Brazil",0.3,3.6,"Croatia",{"$f":"VLOOKUP(A2, KOCoeffs!A$2:B$33, 2, FALSE)","v":2.9},{"$f":"VLOOKUP(D2, KOCoeffs!A$2:B$33, 2, FALSE)","v":165},{"$f":"E2/F2","v":1.7575757575757574E-2},{"$f":"B2","v":0.3},{"$f":"C2","v":3.6}]
["Argentina",0.16700000000000001,5,"Iran",{"$f":"VLOOKUP(A3, KOCoeffs!A$2:B$33, 2, FALSE)","v":4.5},{"$f":"VLOOKUP(D3, KOCoeffs!A$2:B$33, 2, FALSE)","v":1450},3.1034482758620688E-3,{"$f":"B3","v":0.16700000000000001},{"$f":"C3","v":5}]
["Brazil",0.2,4,"Cameroon",{"$f":"VLOOKUP(A4, KOCoeffs!A$2:B$33, 2, FALSE)","v":2.9},{"$f":"VLOOKUP(D4, KOCoeffs!A$2:B$33, 2, FALSE)","v":800},3.6249999999999998E-3,0.2,4]
["Spain",0.25,4,"Australia",{"$f":"VLOOKUP(A5, KOCoeffs!A$2:B$33, 2, FALSE)","v":6},{"$f":"VLOOKUP(D5, KOCoeffs!A$2:B$33, 2, FALSE)","v":850},7.058823529411765E-3,0.25,4]
["France",0.3,3.5,"Honduras",{"$f":"VLOOKUP(A6, KOCoeffs!A$2:B$33, 2, FALSE)","v":21},{"$f":"VLOOKUP(D6, KOCoeffs!A$2:B$33, 2, FALSE)","v":2100},0.01,0.3,3.5]
{"$rows_left_out":44}
{"sheet":"KOCoeffs","index":7,"n_rows":33,"n_cols":28,"rows_kept":33,"cut":false,"hidden":true,"merged":[]}
["TEAM","Ave","bet365","Betfair","Ladbrokes","SkyBet","Will Hill"]
["Algeria",{"$f":"AVERAGE(C2:G2)","v":1400},1500,2000,1000,1500,1000]
["Argentina",4.5,4.5,4.5,4.5,4.5,4.5]
["Australia",850,500,1000,1000,1000,750]
["Belgium",16.8,18,20,16,16,14]
["Bosnia & Herzegovina",170,150,200,200,150,150]
{"$rows_left_out":28}
{"sheet":"OddsTesting","index":8,"n_rows":49,"n_cols":12,"rows_kept":49,"cut":false,"hidden":true,"merged":[]}
[null,"ActWin","ActDraw","ActLoss",null,"PreWin","PreDraw","PreLoss"]
["Brazil",0.3,3.6,9,"Croatia",0.37036391808873292,3.1899376356156859,6.2866799721750848,{"$f":"ABS(B2-F2)","v":7.0363918088732935E-2},{"$f":"ABS(C2-G2)","v":0.4100623643843142},2.7133200278249152,"Yes"]
["Mexico",1.1499999999999999,2,2.5,"Cameroon",0.86623377036086957,2.2867473522545634,2.8069109515406696,{"$f":"ABS(B3-F3)","v":0.28376622963913034},{"$f":"ABS(C3-G3)","v":0.28674735225456338},{"$f":"ABS(D3-H3)","v":0.30691095154066961}]
["Brazil",0.36399999999999999,3.3330000000000002,6,"Mexico",0.39355818519059949,3.1107153729443247,6.0006609426153661,2.9558185190599495E-2,0.22228462705567553,6.6094261536608911E-4]
["Cameroon",2.4,2,1.05,"Croatia",2.6541024136777969,2.2532318644837712,0.9204821905257986,0.25410241367779696,0.25323186448377122,0.12951780947420144]
["Cameroon",12,4,0.2,"Brazil",12,4.2022807023486664,0.20661417612971777,0,0.20228070234866635,6.6141761297177637E-3]
{"$rows_left_out":44}
{"sheet":"GroupQuals","index":9,"n_rows":33,"n_cols":15,"rows_kept":33,"cut":false,"hidden":true,"merged":[]}
[null,"Gr","Tm","Odds (WH)","Sim","Sim%",null,"Odd-1","Tcoeff",1,2,3,4,"Prob"]
["Brazil","A",1,2.5000000000000001E-2,990,{"$f":"E2/1000","v":0.99},null,{"$f":"1/D2","v":40},{"$f":"H2/(SUM(H2:H5))","v":0.94541256171930332},{"$f":"IF(J$1=$C2, $I2, VLOOKUP(J$1, $C$2:$I$5, 7, FALSE)*($I2/(SUM($I$2:$I$5)-VLOOKUP(J$1, $C$2:$I$5, 7, FALSE))))","v":0.94541256171930332},4.490250254261488E-3,2.7608225542969964E-2,2.0759806678857077E-2,{"$f":"J2+K2+L2+M2","v":0.99827084419539192},{"$f":"F2-N2","v":-8.2708441953919243E-3}]
["Cameroon","A",2,5,185,{"$f":"E3/1000","v":0.185},null,{"$f":"1/D3","v":0.2},{"$f":"H3/(SUM(H2:H5))","v":4.7270628085965168E-3},8.1869102123878629E-2,4.7270628085965168E-3,1.3804112771484983E-4,1.0379903339428537E-4,{"$f":"J3+K3+L3+M3","v":8.6838005093584275E-2},{"$f":"F3-N3","v":9.8161994906415723E-2}]
["Croatia","A",3,0.83299999999999996,388,0.38800000000000001,null,1.2004801920768309,{"$f":"H4/(SUM(H2:H5))","v":2.8373726342115949E-2},0.49141117721415745,1.3476141219272175E-4,2.8373726342115949E-2,6.2304341773280548E-4,0.52054270838619887,-0.13254270838619886]
["Mexico","A",4,1.1000000000000001,437,0.437,null,0.90909090909090906,{"$f":"H5/(SUM(H2:H5))","v":2.1486649129984166E-2},0.37213228238126644,1.0205114214230655E-4,6.2745967143113554E-4,2.1486649129984166E-2,0.39434844232482402,4.2651557675175977E-2]
["Australia","B",1,9,31,3.1E-2,null,0.1111111111111111,{"$f":"H6/(SUM(H6:H9))","v":1.2276211016354802E-2},{"$f":"IF(J$1=$C6, $I6, VLOOKUP(J$1, $C$6:$I$9, 7, FALSE)*($I6/(SUM($I$6:$I$9)-VLOOKUP(J$1, $C$6:$I$9, 7, FALSE))))","v":1.2276211016354802E-2},1.8772619256312059E-3,2.9452913814167138E-3,2.40001732628694E-2,{"$f":"J6+K6+L6+M6","v":4.1098937586272116E-2},-1.0098937586272116E-2]
{"$rows_left_out":28}
{"sheet":"GroupQuals (2)","index":10,"n_rows":33,"n_cols":14,"rows_kept":33,"cut":false,"hidden":true,"merged":[]}
[null,"Gr","Tm","Odds (WH)","Sim","Sim%",null,"Odd-1","Tcoeff",1,2,3,4,"Prob"]
["Brazil","A",1,2.5000000000000001E-2,25,{"$f":"E2/25","v":1},null,{"$f":"1/D2","v":40},{"$f":"H2/(SUM(H2:H5))","v":0.94541256171930332},{"$f":"IF(J$1=$C2, $I2, VLOOKUP(J$1, $C$2:$I$5, 7, FALSE)*($I2/(SUM($I$2:$I$5)-VLOOKUP(J$1, $C$2:$I$5, 7, FALSE))))","v":0.94541256171930332},4.490250254261488E-3,2.7608225542969964E-2,2.0759806678857077E-2,{"$f":"J2+K2+L2+M2","v":0.99827084419539192}]
["Cameroon","A",2,5,1,0.04,null,{"$f":"1/D3","v":0.2},{"$f":"H3/(SUM(H2:H5))","v":4.7270628085965168E-3},8.1869102123878629E-2,4.7270628085965168E-3,1.3804112771484983E-4,1.0379903339428537E-4,{"$f":"J3+K3+L3+M3","v":8.6838005093584275E-2}]
["Croatia","A",3,0.83299999999999996,16,0.64,null,1.2004801920768309,{"$f":"H4/(SUM(H2:H5))","v":2.8373726342115949E-2},0.49141117721415745,1.3476141219272175E-4,2.8373726342115949E-2,6.2304341773280548E-4,0.52054270838619887]
["Mexico","A",4,1.1000000000000001,8,0.32,null,0.90909090909090906,{"$f":"H5/(SUM(H2:H5))","v":2.1486649129984166E-2},0.37213228238126644,1.0205114214230655E-4,6.2745967143113554E-4,2.1486649129984166E-2,0.39434844232482402]
["Australia","B",1,9,1,0.04,null,0.1111111111111111,{"$f":"H6/(SUM(H6:H9))","v":1.2276211016354802E-2},{"$f":"IF(J$1=$C6, $I6, VLOOKUP(J$1, $C$6:$I$9, 7, FALSE)*($I6/(SUM($I$6:$I$9)-VLOOKUP(J$1, $C$6:$I$9, 7, FALSE))))","v":1.2276211016354802E-2},1.8772619256312059E-3,2.9452913814167138E-3,2.40001732628694E-2,{"$f":"J6+K6+L6+M6","v":4.1098937586272116E-2}]
{"$rows_left_out":28}
{"sheet":"Simulations","index":11,"n_rows":68,"n_cols":78,"rows_kept":68,"cut":false,"hidden":true,"merged":[[0,36,0,42],[0,43,0,49],[0,64,0,70],[0,71,0,77],[0,50,0,56],[0,57,0,63],[0,0,1,0],[0,8,0,14],[0,15,0,21],[0,22,0,28],[0,29,0,35],[0,1,0,7]]}
["TEAM","Overall",null,null,null,null,null,null,"1st simulation",null,null,null,null,null,null,"2nd simulation",null,null,null,null,null,null,"3rd simulation",null,null,null,null,null,null,"4th simulation",null,null,null,null,null,null,"5th simulation",null,null,null,null,null,null,"6th simulation",null,null,null,null,null,null,"7th simulation",null,null,null,null,null,null,"8th simulation",null,null,null,null,null,null,"9th simulation",null,null,null,null,null,null,"10th simulation"]
[null,"1st","2nd","3rd","4th","QF","KO","GS","1st","2nd","3rd","4th","QF","KO","GS","1st","2nd","3rd","4th","QF","KO","GS","1st","2nd","3rd","4th","QF","KO","GS","1st","2nd","3rd","4th","QF","KO","GS","1st","2nd","3rd","4th","QF","KO","GS","1st","2nd","3rd","4th","QF","KO","GS","1st","2nd","3rd","4th","QF","KO","GS","1st","2nd","3rd","4th","QF","KO","GS","1st","2nd","3rd","4th","QF","KO","GS","1st","2nd","3rd","4th","QF","KO","GS"]
["Algeria",{"$f":"I3+P3+W3+AD3+AK3+AR3+AY3+BF3+BM3+BT3","v":0},{"$f":"J3+Q3+X3+AE3+AL3+AS3+AZ3+BG3+BN3+BU3","v":0},1,1,4,110,884,0,0,0,0,0,9,91,0,0,0,0,0,10,90,0,0,0,0,0,11,89,0,0,0,0,0,8,92,0,0,0,0,1,10,89,0,0,1,0,1,10,88,0,0,0,0,1,11,88,0,0,0,1,1,13,85,0,0,0,0,0,14,86,0,0,0,0,0,14,86]
["Argentina",{"$f":"I4+P4+W4+AD4+AK4+AR4+AY4+BF4+BM4+BT4","v":217},146,154,51,245,178,9,23,17,17,6,24,12,1,18,16,13,6,26,21,0,27,16,10,7,21,19,0,18,17,14,6,25,18,2,29,10,14,3,28,15,1,23,20,15,4,19,19,0,20,16,18,5,19,20,2,22,9,18,2,37,12,0,17,13,15,4,28,21,2,20,12,20,8,18,21,1]
["Australia",0,0,0,0,3,28,969,0,0,0,0,0,4,96,0,0,0,0,0,1,99,0,0,0,0,2,3,95,0,0,0,0,0,4,96,0,0,0,0,0,2,98,0,0,0,0,1,4,95,0,0,0,0,0,4,96,0,0,0,0,0,2,98,0,0,0,0,0,1,99,0,0,0,0,0,3,97]
["Belgium",35,58,53,60,274,405,115,2,6,4,8,32,40,8,5,11,7,7,19,39,12,2,3,5,7,30,43,10,8,4,2,7,31,35,13,5,5,7,2,28,42,11,0,4,6,6,34,38,12,4,5,3,5,26,44,13,2,6,6,10,24,40,12,3,5,9,1,23,45,14,4,9,4,7,27,39,10]
{"$rows_left_out":62}